TI中文支持网
TI专业的中文技术问题咨询交流网站

关于CCS9.0编译的问题

程序没问题,就是 不编译后就出现了问题,之后再让他编译还是同样的问题,

asm2000?我用的是C2000

user6158867:

user6158867:

回复 user6158867:

Description Resource Path Location Type
cannot run asm2000 – file could not be found cannot run asm2000 – file could not be found F2837xS_Adc.c /VI_crm_boost_seg_3_digital_control/sourceC/C++ Problem
cannot run asm2000 – file could not be found cannot run asm2000 – file could not be found F2837xS_CodeStartBranch.asm /VI_crm_boost_seg_3_digital_control/sourceC/C++ Problem
cannot run asm2000 – file could not be found cannot run asm2000 – file could not be found F2837xS_DefaultISR.c /VI_crm_boost_seg_3_digital_control/sourceC/C++ Problem
cannot run asm2000 – file could not be found cannot run asm2000 – file could not be found F2837xS_EPwm.c /VI_crm_boost_seg_3_digital_control/sourceC/C++ Problem
cannot run asm2000 – file could not be found cannot run asm2000 – file could not be found F2837xS_GlobalVariableDefs.c /VI_crm_boost_seg_3_digital_control/sourceC/C++ Problem
cannot run asm2000 – file could not be found cannot run asm2000 – file could not be found F2837xS_PieCtrl.c /VI_crm_boost_seg_3_digital_control/sourceC/C++ Problem
cannot run asm2000 – file could not be found cannot run asm2000 – file could not be found F2837xS_PieVect.c /VI_crm_boost_seg_3_digital_control/sourceC/C++ Problem
cannot run asm2000 – file could not be found cannot run asm2000 – file could not be found F2837xS_SysCtrl.c /VI_crm_boost_seg_3_digital_control/sourceC/C++ Problem
cannot run asm2000 – file could not be found cannot run asm2000 – file could not be found F2837xS_usDelay.asm /VI_crm_boost_seg_3_digital_control/sourceC/C++ Problem
cannot run asm2000 – file could not be found cannot run asm2000 – file could not be found VI_crm_boost_seg_3_digital_control.c /VI_crm_boost_seg_3_digital_control/sourceC/C++ Problem
gmake: *** [source/F2837xS_Adc.obj] Error 1 VI_crm_boost_seg_3_digital_controlC/C++ Problem
gmake: *** [source/F2837xS_CodeStartBranch.obj] Error 1 VI_crm_boost_seg_3_digital_controlC/C++ Problem
gmake: *** [source/F2837xS_CpuTimers.obj] Error 1 VI_crm_boost_seg_3_digital_controlC/C++ Problem
gmake: *** [source/F2837xS_DefaultISR.obj] Error 1 VI_crm_boost_seg_3_digital_controlC/C++ Problem
gmake: *** [source/F2837xS_EPwm.obj] Error 1 VI_crm_boost_seg_3_digital_controlC/C++ Problem
gmake: *** [source/F2837xS_GlobalVariableDefs.obj] Error 1 VI_crm_boost_seg_3_digital_controlC/C++ Problem
gmake: *** [source/F2837xS_Gpio.obj] Error 1 VI_crm_boost_seg_3_digital_controlC/C++ Problem
gmake: *** [source/F2837xS_PieCtrl.obj] Error 1 VI_crm_boost_seg_3_digital_controlC/C++ Problem
gmake: *** [source/F2837xS_PieVect.obj] Error 1 VI_crm_boost_seg_3_digital_controlC/C++ Problem
gmake: *** [source/F2837xS_SysCtrl.obj] Error 1 VI_crm_boost_seg_3_digital_controlC/C++ Problem
gmake: *** [source/F2837xS_usDelay.obj] Error 1 VI_crm_boost_seg_3_digital_controlC/C++ Problem
gmake: *** [source/VI_crm_boost_seg_3_digital_control.obj] Error 1 VI_crm_boost_seg_3_digital_controlC/C++ Problem
gmake: Target 'all' not remade because of errors. VI_crm_boost_seg_3_digital_controlC/C++ Problem

Susan Yang:

回复 user6158867:

请问您编译的是TI例程?您是直接使用了asm2000.exe?

user6158867:

回复 Susan Yang:

我不太清楚,但是我程序没改动之前都能跑得,我用的C2000

user6158867:

回复 Susan Yang:

Susan Yang:

回复 user6158867:

若是可以的话,请您私信一下您的工程,我来测试一下

另外您改动的是什么?

user6158867:

回复 Susan Yang:

我就把我自己写的备用的.c文件删了,然后就出现这个asm2000的问题,然后再另一个工程(本来能运行)把下面这个cmd文件exclude from programe,然后编译也是上面的问题,但是我把它取消exclude后就不能运行了,也是asm2000的问题,之后再第三个本来能编译的工程把主程序复制过去,跑得也是这个问题,我再恢复原程序,结果编译也这样了。。。

Susan Yang:

回复 user6158867:

我这边编译了一下,没有错误,只是一些警告 使用的是CCS10以及2837xS_Generic_RAM_lnk.cmd

user6158867:

回复 Susan Yang:

那是否是设置上哪里出了问题

user6158867:

回复 Susan Yang:

赞(0)
未经允许不得转载:TI中文支持网 » 关于CCS9.0编译的问题
分享到: 更多 (0)